真机调试 app 的时候,进入分包页访问空白,且报错 [JS Framework] Failed to execute the callback function: TypeError:...
2024-02-09项目是运行在小程序和app端的,小程序端没问题,app端跳转的时候会在控制台报错。_[js framework] failed to execute the callback function: typeerror: cannot re
Base64转二进制文件流以及转File、图片转Base64、二进制流转Base64
2024-02-09前端 Base64转二进制文件流以及转File图片转Base64二进制流转Base64_base64转二进制
251: vue openlayers 加载geotiff的瓦片数据
2024-02-05本示例的目的是介绍演示如何在vue openlayers中加载geotiff的瓦片数据。这是官网上的一个示例,借鉴的意义非常大。他将大的tif划分为小块的瓦片tif,然后通过url的方式调用。这里面涉及了TileGrid,WebGLTile,sourcesFromTileGrid等载体内容。 同时也要注意view中的一个参数,showFullExtent,它使得窗口更加的丝滑,不出现空白情况。
vue使用中网页报错Failed to resolve module specifier “vue“. Relative references must start with either “/“
2024-02-02如果你使用的是 Visual Studio Code,那么在左下角可能有一个 "Go Live" 的按钮,它会启动一个本地服务器,提供类似。你应该使用这个地址来访问你的应用程序,而不是使用其他可能由 IDE 或本地服务器插件提供的地址。这两者之间的端口和地址可能不同,因为它们是不同的服务器实例。通常,你应该使用 Vite 提供的服务器地址。但是,在 Vite 项目中,你通常应该使用由 Vite 提供的地址。不要直接通过IDE打开,通过启动vue项目给出的地址打开。这是因为你的项目在不同的开发服务器上运行。_failed to resolve module specifier "vue". relative references must start wit
png/jpg转svg,并下载到本地 ,需要下载png/jpg就简单了
2024-02-02png/jpg转svg,并下载到本地 ,需要下载png/jpg就简单了<!DOCTYPE html><html lang="en"><head> <meta charset="UTF-8"> <title>Title</title> <script src="https://cdn.staticfile.org/jquery/1.10.2/jquery.min.js"></script&g_js png转svg工具
解决sass问题:npm ERR! node-sass@9.0.0 postinstall: `node scripts/build.js`
2024-02-021.运行这个项目的适合,遇到了没有sass的问题,2.下载sass的时候又发现了一个这样的问题npm ERR! code ELIFECYCLEnpm ERR! errno 1npm ERR! node-sass@9.0.0 postinstall: `node scripts/build.js`npm ERR! Exit status 1npm ERR!npm ERR! Failed at the node-sass@9.0.0 postinstall script.npm ERR! This
Error: @vitejs/plugin-vue requires vue (>=3.2.13) or @vue/compiler-sfc to be present in the dependen
2024-02-01创建完vue项目进行启动报错;Error: @vitejs/plugin-vue requires vue (>=3.2.13) or @vue/compiler-sfc to be present in the dependen _error: @vitejs/plugin-vue requires vue (>=3.2.13) or @vue/compiler-sfc to be
VScode无法运行html-——三种解决办法,亲测有效
2024-01-31选中 file-preference-settings,在搜索框选run code,最后选中edit in setting。2.修改JSON文件:调用chrome.exe,即一旦运行html文件就开始调用chrome.exe。情况说明:已安装装了Javascript,code runner,仍然无法运行html。1.最有效也是最终解决问的方法就是安装一个插件, open in browser。好的,这种我也试了,不过还是没解决我的问题,小伙伴你们可以尝试下。但这个方法我用了一直报错。_vscode运行不了html
Module build failed (from ./node_modules/postcss-loader/src/index.js):
2024-01-31出现该错误是你可能没认真看官网的安装配置,可直接看该目录3,一个字一个字看先安装如果选择v1版本,建议使用npm下载,下面以v1版本为例,使用的是npm下载,导入uview时该文件也在node_modules文件夹里面,未移动。然后就是配置。_module build failed (from ./node_modules/postcss-loader/src/index.js):
【Echarts】markLine自定义位置及样式
2024-01-30symbol : [ 'none' , 'arrow' ] , // none为标线两端的样式为无,可更改 data : [ {silent : false , yAxis : 50 , // 警戒线位置,这个赋值为纵轴50 label : {position : 'end' , // 文字位置 formatter : '标准供给时长' , //文字 color : 'green' // 文字颜色 } , lineStyle : {_markline : { data : [ {type : 'average', name: